Reaction Details
TargetHigh affinity nerve growth factor receptor
LigandBDBM134632
Substrate/Competitorn/a
Meas. Tech.Enzyme Assay
IC50 3.95±n/a nM
Citation Andrews, MDBagal, SKGibson, KROmoto, KRyckmans, TSkerratt, SEStupple, PA Pyrrolo[2,3-d]pyrimidine tropomysin-related kinase inhibitors US Patent US8846698 Publication Date 9/30/2014
 
High affinity nerve growth factor receptor
Name:High affinity nerve growth factor receptor
Type:n/a
Mol. Mass.:87498.18
Organism:Homo sapiens (Human)
Description:P04629
Residue:796
BDBM134632
NameBDBM134632
Synonyms:US8846698, 95
TypeSmall organic molecule
Emp. Form.C24H20FN7O2
Mol. Mass.457.4597
SMILESCC(C)n1cc(C(=O)c2cncc(NC(=O)Cn3ncc4cc(F)ccc34)c2)c2cncnc12