Reaction Details
TargetHigh affinity nerve growth factor receptor
LigandBDBM135043
Substrate/Competitorn/a
Meas. Tech.Enzyme Assay
IC50 2.25±n/a nM
Citation Andrews, MDBagal, SKGibson, KROmoto, KRyckmans, TSkerratt, SEStupple, PA Pyrrolo[2,3-d]pyrimidine tropomysin-related kinase inhibitors US Patent US8846698 Publication Date 9/30/2014
 
High affinity nerve growth factor receptor
Name:High affinity nerve growth factor receptor
Type:n/a
Mol. Mass.:87498.18
Organism:Homo sapiens (Human)
Description:P04629
Residue:796
BDBM135043
NameBDBM135043
Synonyms:US8846698, 528
TypeSmall organic molecule
Emp. Form.C25H24N8O2
Mol. Mass.468.5105
SMILESCC(C)(C)n1cc(C(=O)c2cncc(NC(=O)Cc3nc4ccccc4[nH]3)c2)c2cnc(N)nc12