Reaction Details
TargetHigh affinity nerve growth factor receptor
LigandBDBM135053
Substrate/Competitorn/a
Meas. Tech.Enzyme Assay
IC50 1.51±n/a nM
Citation Andrews, MDBagal, SKGibson, KROmoto, KRyckmans, TSkerratt, SEStupple, PA Pyrrolo[2,3-d]pyrimidine tropomysin-related kinase inhibitors US Patent US8846698 Publication Date 9/30/2014
 
High affinity nerve growth factor receptor
Name:High affinity nerve growth factor receptor
Type:n/a
Mol. Mass.:87498.18
Organism:Homo sapiens (Human)
Description:P04629
Residue:796
BDBM135053
NameBDBM135053
Synonyms:US8846698, 538
TypeSmall organic molecule
Emp. Form.C25H27N7O3
Mol. Mass.473.527
SMILESCOCC(C)(C)n1cc(C(=O)c2cncc(NC(=O)Cn3ccc(n3)C3CC3)c2)c2cncnc12