Reaction Details
TargetHigh affinity nerve growth factor receptor
LigandBDBM135059
Substrate/Competitorn/a
Meas. Tech.Enzyme Assay
IC50 5.34±n/a nM
Citation Andrews, MDBagal, SKGibson, KROmoto, KRyckmans, TSkerratt, SEStupple, PA Pyrrolo[2,3-d]pyrimidine tropomysin-related kinase inhibitors US Patent US8846698 Publication Date 9/30/2014
 
High affinity nerve growth factor receptor
Name:High affinity nerve growth factor receptor
Type:n/a
Mol. Mass.:87498.18
Organism:Homo sapiens (Human)
Description:P04629
Residue:796
BDBM135059
NameBDBM135059
Synonyms:US8846698, 546
TypeSmall organic molecule
Emp. Form.C24H22FN5O2
Mol. Mass.431.4622
SMILESCC(C)(C)n1cc(C(=O)c2cncc(NC(=O)Cc3ccc(F)cc3)c2)c2cncnc12