Reaction Details
TargetHigh affinity nerve growth factor receptor
LigandBDBM135065
Substrate/Competitorn/a
Meas. Tech.Enzyme Assay
IC50 7.62±n/a nM
Citation Andrews, MDBagal, SKGibson, KROmoto, KRyckmans, TSkerratt, SEStupple, PA Pyrrolo[2,3-d]pyrimidine tropomysin-related kinase inhibitors US Patent US8846698 Publication Date 9/30/2014
 
High affinity nerve growth factor receptor
Name:High affinity nerve growth factor receptor
Type:n/a
Mol. Mass.:87498.18
Organism:Homo sapiens (Human)
Description:P04629
Residue:796
BDBM135065
NameBDBM135065
Synonyms:US8846698, 552
TypeSmall organic molecule
Emp. Form.C24H27N9O3
Mol. Mass.489.5297
SMILESCOCC(C)(C)n1cc(C(=O)c2cncc(NC(=O)Cn3cc(nn3)C3CC3)c2)c2cnc(N)nc12