Reaction Details
TargetHigh affinity nerve growth factor receptor
LigandBDBM134977
Substrate/Competitorn/a
Meas. Tech.Enzyme Assay
IC50 4.06±n/a nM
Citation Andrews, MDBagal, SKGibson, KROmoto, KRyckmans, TSkerratt, SEStupple, PA Pyrrolo[2,3-d]pyrimidine tropomysin-related kinase inhibitors US Patent US8846698 Publication Date 9/30/2014
 
High affinity nerve growth factor receptor
Name:High affinity nerve growth factor receptor
Type:n/a
Mol. Mass.:87498.18
Organism:Homo sapiens (Human)
Description:P04629
Residue:796
BDBM134977
NameBDBM134977
Synonyms:US8846698, 459
TypeSmall organic molecule
Emp. Form.C23H22N6O2S
Mol. Mass.446.525
SMILESCC(C)n1cc(C(=O)c2cncc(NC(=O)c3csc(n3)C3CCC3)c2)c2cncnc12