Reaction Details
TargetHigh affinity nerve growth factor receptor
LigandBDBM135076
Substrate/Competitorn/a
Meas. Tech.Enzyme Assay
IC50 3.11±n/a nM
Citation Andrews, MDBagal, SKGibson, KROmoto, KRyckmans, TSkerratt, SEStupple, PA Pyrrolo[2,3-d]pyrimidine tropomysin-related kinase inhibitors US Patent US8846698 Publication Date 9/30/2014
 
High affinity nerve growth factor receptor
Name:High affinity nerve growth factor receptor
Type:n/a
Mol. Mass.:87498.18
Organism:Homo sapiens (Human)
Description:P04629
Residue:796
BDBM135076
NameBDBM135076
Synonyms:US8846698, 563
TypeSmall organic molecule
Emp. Form.C22H21F3N8O3
Mol. Mass.502.4491
SMILESCC(C)(CO)n1cc(C(=O)c2cncc(NC(=O)Cn3cc(cn3)C(F)(F)F)c2)c2cnc(N)nc12