Reaction Details
TargetHigh affinity nerve growth factor receptor
LigandBDBM135077
Substrate/Competitorn/a
Meas. Tech.Enzyme Assay
IC50 1.57±n/a nM
Citation Andrews, MDBagal, SKGibson, KROmoto, KRyckmans, TSkerratt, SEStupple, PA Pyrrolo[2,3-d]pyrimidine tropomysin-related kinase inhibitors US Patent US8846698 Publication Date 9/30/2014
 
High affinity nerve growth factor receptor
Name:High affinity nerve growth factor receptor
Type:n/a
Mol. Mass.:87498.18
Organism:Homo sapiens (Human)
Description:P04629
Residue:796
BDBM135077
NameBDBM135077
Synonyms:US8846698, 564
TypeSmall organic molecule
Emp. Form.C25H27N7O5S
Mol. Mass.537.591
SMILESCC(C)(CO)n1cc(C(=O)c2cncc(NC(=O)Cc3ccc(NS(C)(=O)=O)cc3)c2)c2cnc(N)nc12