Reaction Details
TargetHigh affinity nerve growth factor receptor
LigandBDBM135087
Substrate/Competitorn/a
Meas. Tech.Enzyme Assay
IC50 3.09±n/a nM
Citation Andrews, MDBagal, SKGibson, KROmoto, KRyckmans, TSkerratt, SEStupple, PA Pyrrolo[2,3-d]pyrimidine tropomysin-related kinase inhibitors US Patent US8846698 Publication Date 9/30/2014
 
High affinity nerve growth factor receptor
Name:High affinity nerve growth factor receptor
Type:n/a
Mol. Mass.:87498.18
Organism:Homo sapiens (Human)
Description:P04629
Residue:796
BDBM135087
NameBDBM135087
Synonyms:US8846698, 575
TypeSmall organic molecule
Emp. Form.C24H18F3N5O4
Mol. Mass.497.426
SMILESCC1(COC1)n1cc(C(=O)c2cncc(NC(=O)c3cccc(OC(F)(F)F)c3)c2)c2cncnc12