Reaction Details
TargetUDP-3-O-acyl-N-acetylglucosamine deacetylase
LigandBDBM135497
Substrate/Competitorn/a
Meas. Tech.Enzyme Assay
pH8±n/a
IC50 0.144±n/a nM
Commentsextracted
Citation Brown, MFMarfat, AMelnick, MJReilly, U C-linked hydroxamic acid derivatives useful as antibacterial agents US Patent US8853258 Publication Date 10/7/2014
 
UDP-3-O-acyl-N-acetylglucosamine deacetylase
Name:UDP-3-O-acyl-N-acetylglucosamine deacetylase
Type:Enzyme
Mol. Mass.:33428.15
Organism:Pseudomonas aeruginosa
Description:P47205
Residue:303
BDBM135497
NameBDBM135497
Synonyms:US8853258, 109
TypeSmall organic molecule
Emp. Form.C20H22N2O4S
Mol. Mass.386.465
SMILESCc1cc(ccc1C#N)-c1ccc(CCC(C)(C(=O)NO)S(C)(=O)=O)cc1