Reaction Details
TargetUDP-3-O-acyl-N-acetylglucosamine deacetylase
LigandBDBM135527
Substrate/Competitorn/a
Meas. Tech.Enzyme Assay
pH8±n/a
IC50 0.0592±n/a nM
Commentsextracted
Citation Brown, MFMarfat, AMelnick, MJReilly, U C-linked hydroxamic acid derivatives useful as antibacterial agents US Patent US8853258 Publication Date 10/7/2014
 
UDP-3-O-acyl-N-acetylglucosamine deacetylase
Name:UDP-3-O-acyl-N-acetylglucosamine deacetylase
Type:Enzyme
Mol. Mass.:33428.15
Organism:Pseudomonas aeruginosa
Description:P47205
Residue:303
BDBM135527
NameBDBM135527
Synonyms:US8853258, 178
TypeSmall organic molecule
Emp. Form.C18H20FNO5S
Mol. Mass.381.419
SMILESCC(CCc1ccc(cc1F)-c1ccc(O)cc1)(C(=O)NO)S(C)(=O)=O