Reaction Details
TargetUDP-3-O-acyl-N-acetylglucosamine deacetylase
LigandBDBM135562
Substrate/Competitorn/a
Meas. Tech.Enzyme Assay
pH8±n/a
IC50 0.0842±n/a nM
Commentsextracted
Citation Brown, MFMarfat, AMelnick, MJReilly, U C-linked hydroxamic acid derivatives useful as antibacterial agents US Patent US8853258 Publication Date 10/7/2014
 
UDP-3-O-acyl-N-acetylglucosamine deacetylase
Name:UDP-3-O-acyl-N-acetylglucosamine deacetylase
Type:Enzyme
Mol. Mass.:33428.15
Organism:Pseudomonas aeruginosa
Description:P47205
Residue:303
BDBM135562
NameBDBM135562
Synonyms:US8853258, 215
TypeSmall organic molecule
Emp. Form.C19H21NO6S
Mol. Mass.391.438
SMILESC[C@@](CCc1ccc(cc1)-c1ccc2OCOc2c1)(C(=O)NO)S(C)(=O)=O