Reaction Details
TargetMelanocortin receptor 4
LigandBDBM135690
Substrate/Competitorn/a
Meas. Tech.Competitive Inhibition Assay
pH7.5±n/a
Ki 0.6±n/a nM
Commentsextracted
Citation Shi, YSharma, SDDodd, JHYang, WChen, X Melanocortin receptor-specific peptides US Patent US8846601 Publication Date 9/30/2014
 
Melanocortin receptor 4
Name:Melanocortin receptor 4
Type:Enzyme
Mol. Mass.:36949.50
Organism:Homo sapiens (Human)
Description:P32245
Residue:332
BDBM135690
NameBDBM135690
Synonyms:US10179804, Example 75 US8846601, 75 | US9458201, 75
TypeSmall organic molecule
Emp. Form.C50H70N18O9
Mol. Mass.1067.206
SMILESCC(=O)N[C@@H](CCCNC(N)=N)C(=O)N[C@H]1CCCNC(=O)CC[C@H](NC(=O)[C@H](Cc2c[nH]c3ccccc23)NC(=O)[C@H](CCCNC(N)=N)NC(=O)[C@@H](Cc2ccccc2)NC(=O)[C@H](Cc2c[nH]cn2)NC1=O)C(N)=O