Reaction Details
TargetMelanocortin receptor 4
LigandBDBM135752
Substrate/Competitorn/a
Meas. Tech.Competitive Inhibition Assay
pH7.5±n/a
Ki 0.4±n/a nM
Commentsextracted
Citation Shi, YSharma, SDDodd, JHYang, WChen, X Melanocortin receptor-specific peptides US Patent US8846601 Publication Date 9/30/2014
 
Melanocortin receptor 4
Name:Melanocortin receptor 4
Type:Enzyme
Mol. Mass.:36949.50
Organism:Homo sapiens (Human)
Description:P32245
Residue:332
BDBM135752
NameBDBM135752
Synonyms:US10179804, Example 137 US8846601, 137 | US9458201, 137
TypeSmall organic molecule
Emp. Form.C53H79N17O9
Mol. Mass.1098.3029
SMILESNCC[C@@H]1NC(=O)[C@H](CC(=O)NCCCC[C@H](NC(=O)[C@H](Cc2c[nH]c3ccccc23)NC(=O)[C@H](CCCNC(N)=N)NC(=O)[C@@H](Cc2ccccc2)NC1=O)C(N)=O)NC(=O)[C@H](CCCNC(N)=N)NC(=O)C1CCCCC1