Reaction Details
Target5-hydroxytryptamine receptor 5A
LigandBDBM135781
Substrate/Competitorn/a
Meas. Tech.Binding Inhibition Assay
pH7.5±n/a
Temperature298.15±n/a K
Ki 3.7±n/a nM
Commentsextracted
Citation Kinoyama, IMiyazaki, TKoganemaru, YWashio, THamaguchi, W Nitrogenous-ring acylguanidine derivative US Patent US8853242 Publication Date 10/7/2014
 
5-hydroxytryptamine receptor 5A
Name:5-hydroxytryptamine receptor 5A
Type:Enzyme
Mol. Mass.:40266.25
Organism:Homo sapiens (Human)
Description:P47898
Residue:357
BDBM135781
NameBDBM135781
Synonyms:US8853242, 114
TypeSmall organic molecule
Emp. Form.C19H15F3N4O
Mol. Mass.372.3438
SMILESCc1nc2ccc(cc2c(c1C)-c1c(F)cc(F)cc1F)C(=O)N=C(N)N