Reaction Details
Target5-hydroxytryptamine receptor 5A
LigandBDBM135795
Substrate/Competitorn/a
Meas. Tech.Binding Inhibition Assay
pH7.5±n/a
Temperature298.15±n/a K
Ki 1.8±n/a nM
Commentsextracted
Citation Kinoyama, IMiyazaki, TKoganemaru, YWashio, THamaguchi, W Nitrogenous-ring acylguanidine derivative US Patent US8853242 Publication Date 10/7/2014
 
5-hydroxytryptamine receptor 5A
Name:5-hydroxytryptamine receptor 5A
Type:Enzyme
Mol. Mass.:40266.25
Organism:Homo sapiens (Human)
Description:P47898
Residue:357
BDBM135795
NameBDBM135795
Synonyms:US8853242, 192
TypeSmall organic molecule
Emp. Form.C18H15FN4O
Mol. Mass.322.3363
SMILES[#6]-c1cnc(-c2ccccc2F)c2cc(ccc12)-[#6](=O)\[#7]=[#6](\[#7])-[#7]