Reaction Details
TargetCannabinoid receptor 2
LigandBDBM135893
Substrate/Competitorn/a
Meas. Tech.Radioligand Binding Assay
pH7.4±n/a
Temperature303.15±n/a K
Ki 1±n/a nM
Commentsextracted
Citation Carroll, WADart, MJFrost, JMLatshaw, SPKolasa, TLi, TPeddi, SLiu, BPerez-Medrano, APatel, MWang, XNelson, DW Compounds as cannabinoid receptor ligands US Patent US8859596 Publication Date 10/14/2014
 
Cannabinoid receptor 2
Name:Cannabinoid receptor 2
Type:G Protein-Coupled Receptor (GPCR)
Mol. Mass.:39690.94
Organism:Homo sapiens (Human)
Description:P34972
Residue:360
BDBM135893
NameBDBM135893
Synonyms:US8859596, 181
TypeSmall organic molecule
Emp. Form.C23H32F3N5O3S
Mol. Mass.515.592
SMILESCCCCn1nc(s\c1=N\C(=O)c1cc(ccc1NNC(=O)OC(C)(C)C)C(F)(F)F)C(C)(C)C