Reaction Details
TargetCannabinoid receptor 2
LigandBDBM135860
Substrate/Competitorn/a
Meas. Tech.Radioligand Binding Assay
pH7.4±n/a
Ki 0.7±n/a nM
Commentsextracted
Citation Carroll, WADart, MJFrost, JMLatshaw, SPKolasa, TLi, TPeddi, SLiu, BPerez-Medrano, APatel, MWang, XNelson, DW Compounds as cannabinoid receptor ligands US Patent US8859596 Publication Date 10/14/2014
 
Cannabinoid receptor 2
Name:Cannabinoid receptor 2
Type:Enzyme
Mol. Mass.:39366.68
Organism:Rattus norvegicus (Rat)
Description:Q9QZN9
Residue:360
BDBM135860
NameBDBM135860
Synonyms:US8859596, 147
TypeSmall organic molecule
Emp. Form.C24H33F3N4O3S
Mol. Mass.514.604
SMILESCC(C)(C)NOc1ccc(cc1C(=O)\N=c1/sc(nn1CC1CCCCO1)C(C)(C)C)C(F)(F)F