Reaction Details
TargetPurine nucleoside phosphorylase
LigandBDBM136307
Substrate/Competitorn/a
Meas. Tech.Inhibition Assay
Temperature298.15±n/a K
Kd 13000±n/a nM
Commentsextracted
Citation Clinch, KEvans, GBFurneaux, RHGulab, SAKelly, PMSchramm, VLTyler, PCWoolhouse, AD Acyclic amine inhibitors of nucleoside phosphorylases and hydrolases US Patent US8853224 Publication Date 10/7/2014
 
Purine nucleoside phosphorylase
Name:Purine nucleoside phosphorylase
Type:Enzyme
Mol. Mass.:26857.85
Organism:Plasmodium falciparum
Description:n/a
Residue:245
BDBM136307
NameBDBM136307
Synonyms:US8853224, 25
TypeSmall organic molecule
Emp. Form.C12H18N4O3S
Mol. Mass.298.361
SMILESCSC[C@@H](NCc1c[nH]c2c(O)ncnc12)[C@@H](O)CO