Reaction Details
TargetPurine nucleoside phosphorylase
LigandBDBM50293060
Substrate/Competitorn/a
Meas. Tech.Inhibition Assay
Temperature298.15±n/a K
Kd 297±n/a nM
Commentsextracted
Citation Clinch, KEvans, GBFurneaux, RHGulab, SAKelly, PMSchramm, VLTyler, PCWoolhouse, AD Acyclic amine inhibitors of nucleoside phosphorylases and hydrolases US Patent US8853224 Publication Date 10/7/2014
 
Purine nucleoside phosphorylase
Name:Purine nucleoside phosphorylase
Type:Enzyme
Mol. Mass.:26857.85
Organism:Plasmodium falciparum
Description:n/a
Residue:245
BDBM50293060
NameBDBM50293060
Synonyms:7-{(1S)-1-[(1,3-Dihydroxypropan-2-yl)amino]-2-hydroxyethyl}-3,5-dihydro-4H-pyrrolo[3,2-d]pyrimidin-4-one | CHEMBL522757
TypeSmall organic molecule
Emp. Form.C11H16N4O4
Mol. Mass.268.2691
SMILESOCC(CO)N[C@H](CO)c1c[nH]c2c1nc[nH]c2=O