Reaction Details
Target5-hydroxytryptamine receptor 1A
LigandBDBM136334
Substrate/Competitorn/a
Meas. Tech.Inhibition Assay
pH7.4±n/a
Ki 1.1±n/a nM
Commentsextracted
Citation Andersson, JGyback, HJohansson, ALinde, CEMalmstrom, JNordvall, GWeigelt, TTerp, G 2-carboxamide-7-piperazinyl-benzofuran derivatives US Patent US8859534 Publication Date 10/14/2014
 
5-hydroxytryptamine receptor 1A
Name:5-hydroxytryptamine receptor 1A
Synonyms:5-hydroxytryptamine receptor 1A (5HT1A)
Type:Protein
Mol. Mass.:46351.20
Organism:Cricetulus griseus (Chinese hamster) (Cricetulus barabensis griseus)
Description:G3I1B6
Residue:422
BDBM136334
NameBDBM136334
Synonyms:US8859534, 20
TypeSmall organic molecule
Emp. Form.C27H26N6O2
Mol. Mass.466.5343
SMILESO=C(NCc1ccc(nc1)C#N)c1cc2cccc(N3CCN(CCc4ccccn4)CC3)c2o1