Reaction Details
Target5-hydroxytryptamine receptor 1A
LigandBDBM136367
Substrate/Competitorn/a
Meas. Tech.Inhibition Assay
pH7.4±n/a
Ki 0.35±n/a nM
Commentsextracted
Citation Andersson, JGyback, HJohansson, ALinde, CEMalmstrom, JNordvall, GWeigelt, TTerp, G 2-carboxamide-7-piperazinyl-benzofuran derivatives US Patent US8859534 Publication Date 10/14/2014
 
5-hydroxytryptamine receptor 1A
Name:5-hydroxytryptamine receptor 1A
Synonyms:5-hydroxytryptamine receptor 1A (5HT1A)
Type:Protein
Mol. Mass.:46351.20
Organism:Cricetulus griseus (Chinese hamster) (Cricetulus barabensis griseus)
Description:G3I1B6
Residue:422
BDBM136367
NameBDBM136367
Synonyms:US8859534, 53
TypeSmall organic molecule
Emp. Form.C22H25BrN4O2
Mol. Mass.457.364
SMILESCN(C)C(=O)c1cc2c(Br)ccc(N3CCN(CCc4ccccn4)CC3)c2o1