Reaction Details
Target5-hydroxytryptamine receptor 1B
LigandBDBM136352
Substrate/Competitorn/a
Meas. Tech.Inhibition Assay
pH7.4±n/a
Ki 1.6±n/a nM
Commentsextracted
Citation Andersson, JGyback, HJohansson, ALinde, CEMalmstrom, JNordvall, GWeigelt, TTerp, G 2-carboxamide-7-piperazinyl-benzofuran derivatives US Patent US8859534 Publication Date 10/14/2014
 
5-hydroxytryptamine receptor 1B
Name:5-hydroxytryptamine receptor 1B
Type:Protein
Mol. Mass.:42909.60
Organism:Cricetulus griseus (Chinese hamster) (Cricetulus barabensis griseus)
Description:P46636
Residue:386
BDBM136352
NameBDBM136352
Synonyms:US8859534, 38
TypeSmall organic molecule
Emp. Form.C27H32N4O3
Mol. Mass.460.568
SMILESCN(C)C(=O)c1cc2cccc(N3CCN(CCc4ccc5N(CCc5c4)C(C)=O)CC3)c2o1