Reaction Details
TargetRegulator of G-protein signaling 4
LigandBDBM50384774
Substrate/Competitorn/a
Meas. Tech.Inhibitory Assay
IC50 30±n/a nM
Citation Neubig, RBlazer, LHusbands, SLarsen, STraynor, J Small molecule inhibitors of RGS proteins US Patent US8865750 Publication Date 10/21/2014
 
Regulator of G-protein signaling 4
Name:Regulator of G-protein signaling 4
Type:Enzyme
Mol. Mass.:23263.51
Organism:Homo sapiens (Human)
Description:P49798
Residue:205
BDBM50384774
NameBDBM50384774
Synonyms:CHEMBL1917204 | US20230414581, Compound 6
TypeSmall organic molecule
Emp. Form.C16H13FN2O2S
Mol. Mass.316.35
SMILESCc1ccc(cc1)-n1sc(=O)n(Cc2ccc(F)cc2)c1=O