Reaction Details
TargetSerine/threonine-protein kinase mTOR
LigandBDBM136385
Substrate/Competitorn/a
Meas. Tech.Kinase Assay
pH7.5±n/a
Temperature295.15±n/a K
IC50 1.5±n/a nM
Commentsextracted
Citation Andrews, SWCondroski, KRDe Meese, LAFell, JBFischer, JPJosey, JAKoch, KLe Huerou, YMiknis, GFRodriguez, METopalov, GTWallace, EMXu, R Substituted pyrazolo[1,5-a]pyrimidine compounds as mTOR inhibitors US Patent US8865726 Publication Date 10/21/2014
 
Serine/threonine-protein kinase mTOR
Name:Serine/threonine-protein kinase mTOR
Type:Rapamycin target protein
Mol. Mass.:288917.12
Organism:Homo sapiens (Human)
Description:P42345
Residue:2549
BDBM136385
NameBDBM136385
Synonyms:US8865726, 16
TypeSmall organic molecule
Emp. Form.C24H27N7O2
Mol. Mass.445.5169
SMILESCC(C)[C@H]1CN(CCCO)C(=O)N1c1ccn2ncc(-c3ccc(cc3)-c3ncc[nH]3)c2n1