Reaction Details
TargetSerine/threonine-protein kinase mTOR
LigandBDBM136430
Substrate/Competitorn/a
Meas. Tech.Kinase Assay
pH7.5±n/a
Temperature295.15±n/a K
IC50 3.5±n/a nM
Commentsextracted
Citation Andrews, SWCondroski, KRDe Meese, LAFell, JBFischer, JPJosey, JAKoch, KLe Huerou, YMiknis, GFRodriguez, METopalov, GTWallace, EMXu, R Substituted pyrazolo[1,5-a]pyrimidine compounds as mTOR inhibitors US Patent US8865726 Publication Date 10/21/2014
 
Serine/threonine-protein kinase mTOR
Name:Serine/threonine-protein kinase mTOR
Type:Rapamycin target protein
Mol. Mass.:288917.12
Organism:Homo sapiens (Human)
Description:P42345
Residue:2549
BDBM136430
NameBDBM136430
Synonyms:US8865726, 61
TypeSmall organic molecule
Emp. Form.C23H23N7O2
Mol. Mass.429.4744
SMILESO=C1OC[C@H](C2CCCCC2)N1c1ccn2ncc(-c3ccc(cc3)-c3nc[nH]n3)c2n1