Reaction Details
TargetSerine/threonine-protein kinase mTOR
LigandBDBM136478
Substrate/Competitorn/a
Meas. Tech.Kinase Assay
pH7.5±n/a
Temperature295.15±n/a K
IC50 0.51±n/a nM
Commentsextracted
Citation Andrews, SWCondroski, KRDe Meese, LAFell, JBFischer, JPJosey, JAKoch, KLe Huerou, YMiknis, GFRodriguez, METopalov, GTWallace, EMXu, R Substituted pyrazolo[1,5-a]pyrimidine compounds as mTOR inhibitors US Patent US8865726 Publication Date 10/21/2014
 
Serine/threonine-protein kinase mTOR
Name:Serine/threonine-protein kinase mTOR
Type:Rapamycin target protein
Mol. Mass.:288917.12
Organism:Homo sapiens (Human)
Description:P42345
Residue:2549
BDBM136478
NameBDBM136478
Synonyms:US8865726, 109
TypeSmall organic molecule
Emp. Form.C23H15F2N7O2
Mol. Mass.459.4077
SMILESFc1ccc(cc1)[C@H]1COC(=O)N1c1ccn2ncc(-c3ccc(-c4nc[nH]n4)c(F)c3)c2n1