Reaction Details
TargetHistone deacetylase 1
LigandBDBM136702
Substrate/Competitorn/a
Meas. Tech.Fluorescent Activity Assay
Temperature298.15±n/a K
IC50 4.4±0.45 nM
Commentsextracted
Citation Ganesan, APackham, GKCecil, AR Depsipeptides and their therapeutic use US Patent US8865655 Publication Date 10/21/2014
 
Histone deacetylase 1
Name:Histone deacetylase 1
Type:Enzyme
Mol. Mass.:55090.27
Organism:Homo sapiens (Human)
Description:Q13547
Residue:482
BDBM136702
NameBDBM136702
Synonyms:US8865655, 10
TypeSmall organic molecule
Emp. Form.C22H37N3O6S
Mol. Mass.471.611
SMILESCC(C)[C@H]1NC(=O)[C@@H](C)NC(=O)[C@H](NC(=O)C[C@H](OC(=O)C[C@@H]1O)\C=C\CCS)C(C)C