Reaction Details
TargetBeta-secretase 1
LigandBDBM41537
Substrate/Competitorn/a
Meas. Tech.TR-FRET Assay
pH9.2±n/a
IC50 1.2±n/a nM
Commentsextracted
Citation Csjernyik, GKarlstrom, SKers, AKolmodin, KNylof, MOhberg, LRakos, LSandberg, LSehgelmeble, FSoderman, PSwahn, BVon Berg, S Compounds and their use as BACE inhibitors US Patent US8865911 Publication Date 10/21/2014
 
Beta-secretase 1
Name:Beta-secretase 1
Type:Protein
Mol. Mass.:55755.10
Organism:Homo sapiens (Human)
Description:P56817
Residue:501
BDBM41537
NameBDBM41537
Synonyms:US10231967, Example 114 US9918985, Example 114
Typen/a
Emp. Form.C26H28N4O
Mol. Mass.412.5267
SMILESCO[C@H]1CC[C@@]2(Cc3ccc(cc3[C@@]22N=C(C)C(N)=N2)-c2cncc(c2)C#CC)CC1