Reaction Details
TargetBeta-secretase 1
LigandBDBM136833
Substrate/Competitorn/a
Meas. Tech.Diluted TR-FRET Assay
pH9.2±n/a
IC50 1.3±n/a nM
Commentsextracted
Citation Csjernyik, GKarlstrom, SKers, AKolmodin, KNylof, MOhberg, LRakos, LSandberg, LSehgelmeble, FSoderman, PSwahn, BVon Berg, S Compounds and their use as BACE inhibitors US Patent US8865911 Publication Date 10/21/2014
 
Beta-secretase 1
Name:Beta-secretase 1
Type:Protein
Mol. Mass.:55755.10
Organism:Homo sapiens (Human)
Description:P56817
Residue:501
BDBM136833
NameBDBM136833
Synonyms:US10231967, Example 73 US9000182, 21, isomer 1 | US9918985, Example 73
TypeSmall organic molecule
Emp. Form.C25H26N4O
Mol. Mass.398.5001
SMILESCC#Cc1cncc(c1)-c1ccc2C[C@@]3(CC[C@H](O)CC3)[C@]3(N=C(C)C(N)=N3)c2c1