Reaction Details
TargetBeta-secretase 1
LigandBDBM136847
Substrate/Competitorn/a
Meas. Tech.Diluted TR-FRET Assay
pH9.2±n/a
IC50 2.1±n/a nM
Commentsextracted
Citation Csjernyik, GKarlstrom, SKers, AKolmodin, KNylof, MOhberg, LRakos, LSandberg, LSehgelmeble, FSoderman, PSwahn, BVon Berg, S Compounds and their use as BACE inhibitors US Patent US8865911 Publication Date 10/21/2014
 
Beta-secretase 1
Name:Beta-secretase 1
Type:Protein
Mol. Mass.:55755.10
Organism:Homo sapiens (Human)
Description:P56817
Residue:501
BDBM136847
NameBDBM136847
Synonyms:US10231967, Example 84 US9918985, Example 84
TypeSmall organic molecule
Emp. Form.C24H25F3N4O
Mol. Mass.442.4767
SMILESCO[C@H]1CC[C@@]2(Cc3ccc(cc3[C@@]22N=C(C)C(N)=N2)-c2cncc(c2)C(F)(F)F)CC1