Reaction Details
TargetDipeptidyl peptidase 1
LigandBDBM138116
Substrate/Competitorn/a
Meas. Tech.Inhibition Assay
pH6±n/a
Temperature298.15±n/a K
Ki 17.3±n/a nM
Commentsextracted
Citation Anderskewitz, RGrundl, MMorschhaeuser, GOost, TPautsch, A Substituted 2-aza-bicyclo[2.2.1]heptane-3-carboxylic acid (cyano-methyl)-amides inhibitors of cathepsin C US Patent US8871783 Publication Date 10/28/2014
 
Dipeptidyl peptidase 1
Name:Dipeptidyl peptidase 1
Type:Enzyme
Mol. Mass.:51857.28
Organism:Homo sapiens (Human)
Description:P53634
Residue:463
BDBM138116
NameBDBM138116
Synonyms:US8871783, 2
TypeSmall organic molecule
Emp. Form.C21H23N3O3S2
Mol. Mass.429.556
SMILESCS(=O)(=O)c1ccc(cc1)-c1ccc(C[C@H](NC(=O)[C@H]2N[C@@H]3CC[C@H]2C3)C#N)s1