Reaction Details
TargetDipeptidyl peptidase 1
LigandBDBM138120
Substrate/Competitorn/a
Meas. Tech.Inhibition Assay
pH6±n/a
Temperature298.15±n/a K
Ki 64.1±n/a nM
Commentsextracted
Citation Anderskewitz, RGrundl, MMorschhaeuser, GOost, TPautsch, A Substituted 2-aza-bicyclo[2.2.1]heptane-3-carboxylic acid (cyano-methyl)-amides inhibitors of cathepsin C US Patent US8871783 Publication Date 10/28/2014
 
Dipeptidyl peptidase 1
Name:Dipeptidyl peptidase 1
Type:Enzyme
Mol. Mass.:51857.28
Organism:Homo sapiens (Human)
Description:P53634
Residue:463
BDBM138120
NameBDBM138120
Synonyms:US8871783, 6
TypeSmall organic molecule
Emp. Form.C18H18BrN3O2
Mol. Mass.388.258
SMILESBrc1ccc2oc(CC(NC(=O)[C@H]3N[C@@H]4CC[C@H]3C4)C#N)cc2c1