Reaction Details
TargetDipeptidyl peptidase 1
LigandBDBM138139
Substrate/Competitorn/a
Meas. Tech.Inhibition Assay
pH6±n/a
Temperature298.15±n/a K
Ki 4±n/a nM
Commentsextracted
Citation Anderskewitz, RGrundl, MMorschhaeuser, GOost, TPautsch, A Substituted 2-aza-bicyclo[2.2.1]heptane-3-carboxylic acid (cyano-methyl)-amides inhibitors of cathepsin C US Patent US8871783 Publication Date 10/28/2014
 
Dipeptidyl peptidase 1
Name:Dipeptidyl peptidase 1
Type:Enzyme
Mol. Mass.:51857.28
Organism:Homo sapiens (Human)
Description:P53634
Residue:463
BDBM138139
NameBDBM138139
Synonyms:US8871783, 25
TypeSmall organic molecule
Emp. Form.C24H25N3O3S
Mol. Mass.435.539
SMILESCC1(C)OC(=O)c2ccc(cc12)-c1ccc(C[C@H](NC(=O)[C@H]2N[C@@H]3CC[C@H]2C3)C#N)s1