Reaction Details
TargetNeprilysin
LigandBDBM138391
Substrate/Competitorn/a
Meas. Tech.In Vitro Inhibition Assay
pH7.4±n/a
Temperature298.15±n/a K
IC50 0.3±n/a nM
Commentsextracted
Citation Iwaki, YKawanami, TKsander, GMMoji, M Substituted carbamoylmethylamino acetic acid derivatives as novel NEP inhibitors US Patent US8877786 Publication Date 11/4/2014
 
Neprilysin
Name:Neprilysin
Type:Enzyme
Mol. Mass.:85505.38
Organism:Homo sapiens (Human)
Description:P08473
Residue:750
BDBM138391
NameBDBM138391
Synonyms:US8877786, Example 3-2
TypeSmall organic molecule
Emp. Form.C23H26Cl2N6O3
Mol. Mass.505.397
SMILESC[C@H](N[C@@H](Cc1ccc(cc1)-c1cc(Cl)ccc1Cl)C(=O)Nc1nnn[nH]1)C(=O)OC(C)(C)C