Reaction Details
TargetNeprilysin
LigandBDBM138395
Substrate/Competitorn/a
Meas. Tech.In Vitro Inhibition Assay
pH7.4±n/a
Temperature298.15±n/a K
IC50 0.2±n/a nM
Commentsextracted
Citation Iwaki, YKawanami, TKsander, GMMoji, M Substituted carbamoylmethylamino acetic acid derivatives as novel NEP inhibitors US Patent US8877786 Publication Date 11/4/2014
 
Neprilysin
Name:Neprilysin
Type:Enzyme
Mol. Mass.:85505.38
Organism:Homo sapiens (Human)
Description:P08473
Residue:750
BDBM138395
NameBDBM138395
Synonyms:US8877786, Example 3-12
TypeSmall organic molecule
Emp. Form.C26H27ClN6O3
Mol. Mass.506.984
SMILESOC(=O)[C@H](CCc1ccccc1)N[C@@H](Cc1ccc(cc1)-c1cccc(Cl)c1)C(=O)NC1=NNNN1