Reaction Details
TargetPeptidyl-prolyl cis-trans isomerase A
LigandBDBM285697
Substrate/Competitorn/a
Meas. Tech.Protease-Free PPIase Assay
pH7.8±n/a
Ki 4.10±n/a nM
Commentsextracted
Citation Pettit, SNJones, ADFrydrych, CSThomas, AJGarst, ME Cyclosporins modified on the MeBmt sidechain by heterocyclic rings US Patent US10077289 Publication Date 9/18/2018
 
Peptidyl-prolyl cis-trans isomerase A
Name:Peptidyl-prolyl cis-trans isomerase A
Type:Protein
Mol. Mass.:18015.32
Organism:Homo sapiens (Human)
Description:P62937
Residue:165
BDBM285697
NameBDBM285697
Synonyms:US10077289, Compound 5 | [(2S,3R,4R)-3-Hydroxy-4-methyl-2-(methylamino)-5-(1-(pyridin-2-yl-methyl)-1H-imidazol-2-yl)-pentanoic acid]1 [(R)-methyl-Sar]3cyclosporin A
TypeSmall organic molecule
Emp. Form.C69H116N14O12
Mol. Mass.1333.7459
SMILESCC[C@H]1NC(=O)[C@@H]([C@H](O)[C@H](C)Cc2nccn2Cc2ccccn2)N(C)C(=O)[C@@H](C(C)C)N(C)C(=O)[C@@H](CC(C)C)N(C)C(=O)[C@@H](CC(C)C)N(C)C(=O)[C@H](C)NC(=O)[C@@H](C)NC(=O)[C@@H](CC(C)C)N(C)C(=O)[C@H](NC(=O)[C@H](CC(C)C)N(C)C(=O)[C@@H](C)N(C)C1=O)C(C)C