Reaction Details
TargetPeptidyl-prolyl cis-trans isomerase A
LigandBDBM285713
Substrate/Competitorn/a
Meas. Tech.Protease-Free PPIase Assay
pH7.8±n/a
Ki 3.20±n/a nM
Commentsextracted
Citation Pettit, SNJones, ADFrydrych, CSThomas, AJGarst, ME Cyclosporins modified on the MeBmt sidechain by heterocyclic rings US Patent US10077289 Publication Date 9/18/2018
 
Peptidyl-prolyl cis-trans isomerase A
Name:Peptidyl-prolyl cis-trans isomerase A
Type:Protein
Mol. Mass.:18015.32
Organism:Homo sapiens (Human)
Description:P62937
Residue:165
BDBM285713
NameBDBM285713
Synonyms:US10077289, Compound 21 | [(2S,3R,4R)-3-Hydroxy-4-methyl-2-(methylamino)-7-(pyridazin-3-yl)-heptanoic acid]1 [(R)-methyl-Sar]3 cyclosporin A
TypeSmall organic molecule
Emp. Form.C66H115N13O12
Mol. Mass.1282.6992
SMILESCC[C@H]1NC(=O)[C@@H]([C@H](O)[C@H](C)CCCc2cccnn2)N(C)C(=O)[C@@H](C(C)C)N(C)C(=O)[C@@H](CC(C)C)N(C)C(=O)[C@@H](CC(C)C)N(C)C(=O)[C@H](C)NC(=O)[C@@H](C)NC(=O)[C@@H](CC(C)C)N(C)C(=O)[C@H](NC(=O)[C@H](CC(C)C)N(C)C(=O)[C@@H](C)N(C)C1=O)C(C)C