Reaction Details
TargetNeuronal acetylcholine receptor subunit alpha-7
LigandBDBM139022
Substrate/Competitorn/a
Meas. Tech.Binding Assay
pH7.4±n/a
Temperature277.15±n/a K
Ki 80±n/a nM
Commentsextracted
Citation Hendrix, MBöβ, FErb, CFleβner, Tvan Kampen, MLuithle, JMethfessel, CWiese, W 2-heteroarylcarboxylic acid amides US Patent US8884017 Publication Date 11/11/2014
 
Neuronal acetylcholine receptor subunit alpha-7
Name:Neuronal acetylcholine receptor subunit alpha-7
Type:n/a
Mol. Mass.:56448.33
Organism:Homo sapiens (Human)
Description: CHRNA7 (NACHRA7)
Residue:502
BDBM139022
NameBDBM139022
Synonyms:US8884017, 37
TypeSmall organic molecule
Emp. Form.C16H19N3O2
Mol. Mass.285.341
SMILESNc1cccc2cc(oc12)C(=O)N[C@H]1CN2CCC1CC2