Reaction Details
TargetNeuronal acetylcholine receptor subunit alpha-7
LigandBDBM139028
Substrate/Competitorn/a
Meas. Tech.Binding Assay
pH7.4±n/a
Temperature277.15±n/a K
Ki 20±n/a nM
Commentsextracted
Citation Hendrix, MBöβ, FErb, CFleβner, Tvan Kampen, MLuithle, JMethfessel, CWiese, W 2-heteroarylcarboxylic acid amides US Patent US8884017 Publication Date 11/11/2014
 
Neuronal acetylcholine receptor subunit alpha-7
Name:Neuronal acetylcholine receptor subunit alpha-7
Type:n/a
Mol. Mass.:56448.33
Organism:Homo sapiens (Human)
Description: CHRNA7 (NACHRA7)
Residue:502
BDBM139028
NameBDBM139028
Synonyms:US8884017, 59
TypeSmall organic molecule
Emp. Form.C16H17FN2OS
Mol. Mass.304.382
SMILESFc1cccc2cc(sc12)C(=O)N[C@@H]1CN2CCC1CC2