Reaction Details
TargetBcl-2-like protein 1
LigandBDBM139045
Substrate/Competitorn/a
Meas. Tech.Time Resolved-Fluorescence Resonance Energy Transfer (TR-FRET) Assay
Temperature298.15±n/a K
Ki 17±n/a nM
Commentsextracted
Citation Judd, ASSouers, AJTao, Z Apoptosis-inducing agents for the treatment of cancer and immune and autoimmune diseases US Patent US8883784 Publication Date 11/11/2014
 
Bcl-2-like protein 1
Name:Bcl-2-like protein 1
Type:Mitochondrion membrane; Single-pass membrane protein
Mol. Mass.:26039.60
Organism:Homo sapiens (Human)
Description:n/a
Residue:233
BDBM139045
NameBDBM139045
Synonyms:US8883784, 6
TypeSmall organic molecule
Emp. Form.C42H42N8O6S2
Mol. Mass.818.963
SMILESCN(C)CCCNc1ccc(cc1[N+]([O-])=O)S(=O)(=O)NC(=O)c1nc(ccc1CCc1ccccc1)N1CCc2cccc(C(=O)Nc3nc4ccccc4s3)c2C1