Reaction Details
TargetSerine/threonine-protein kinase PLK1
LigandBDBM50329929
Substrate/Competitorn/a
Meas. Tech.Biochemical Assay
pH7.9±n/a
IC50 1±n/a nM
Citation Caruso, MBeria, IBrasca, MGFerguson, RPosteri, HValsasina, B Substituted pyrazolo-quinazoline derivatives, process for their preparation and their use as kinase inhibitors US Patent US8614220 Publication Date 12/24/2013
 
Serine/threonine-protein kinase PLK1
Name:Serine/threonine-protein kinase PLK1
Type:Serine/threonine-protein kinase
Mol. Mass.:68277.16
Organism:Homo sapiens (Human)
Description:P53350
Residue:603
BDBM50329929
NameBDBM50329929
Synonyms:8-(5-(piperazin-1-yl)-2-(trifluoromethoxy)phenylamino)-1-vinyl-4,5-dihydro-1H-pyrazolo[4,3-h]quinazoline-3-carboxamide | CHEMBL1271870
TypeSmall organic molecule
Emp. Form.C24H25F3N8O2
Mol. Mass.514.5029
SMILESCN1CCN(CC1)c1ccc(OC(F)(F)F)c(Nc2ncc3CCc4c(nn(C=C)c4-c3n2)C(N)=O)c1