Reaction Details
TargetNeuraminidase
LigandBDBM139222
Substrate/Competitorn/a
Meas. Tech.Enzyme Assay
Temperature298.15±n/a K
Ki 20000±n/a nM
IC50 92000±n/a nM
Commentsextracted
Citation Wulff, JEBrant, MGMason, JWBromba, CMBoulanger, MJ Synthesis of bicyclic compounds and method for their use as therapeutic agents US Patent US8883846 Publication Date 11/11/2014
 
Neuraminidase
Name:Neuraminidase
Synonyms:n/a
Type:Enzyme
Mol. Mass.:51689.62
Organism:Influenza A virus (A/Brisbane/59/2007(H1N1))
Description:D5F1R0
Residue:470
BDBM139222
NameBDBM139222
TypeSmall organic molecule
Emp. Form.C10H16N2O5S
Mol. Mass.276.309
SMILESCC(=O)N[C@H]1CS(=O)(=O)[C@@H]2[C@H](C[C@@H](N)[C@H]12)C(O)=O