Reaction Details
Target5-hydroxytryptamine receptor 2A
LigandBDBM50232153
Substrate/Competitorn/a
Meas. Tech.Radioligand Binding Assay
Temperature277.15±n/a K
Ki 0.030±0.006 nM
Commentsextracted
Citation Vanover, KEWeiner, DMMakhay, MVeinbergs, IGardell, LRLameh, JDel Tredici, ALPiu, FSchiffer, HHOtt, TRBurstein, ESUldam, AKThygesen, MBSchlienger, NAndersson, CMSon, TYHarvey, SCPowell, SBGeyer, MATolf, BRBrann, MRDavis, RE Pharmacological and behavioral profile of N-(4-fluorophenylmethyl)-N-(1-methylpiperidin-4-yl)-N'-(4-(2-methylpropyloxy)phenylmethyl) carbamide (2R,3R)-dihydroxybutanedioate (2:1) (ACP-103), a novel 5-hydroxytryptamine(2A) receptor inverse agonist. J Pharmacol Exp Ther317:910-8 (2006) 
 
5-hydroxytryptamine receptor 2A
Name:5-hydroxytryptamine receptor 2A
Type:undefined
Mol. Mass.:52607.65
Organism:Homo sapiens (Human)
Description:P28223
Residue:471
BDBM50232153
NameBDBM50232153
Synonyms:(1-(4-fluorophenethyl)piperidin-4-yl)(2,3-dimethoxyphenyl)methanol CHEMBL257283 MDL-100907
TypeSmall organic molecule
Emp. Form.C22H28FNO3
Mol. Mass.373.461
SMILESCOc1cccc(C(O)C2CCN(CCc3ccc(F)cc3)CC2)c1OC