Reaction Details
TargetNuclear receptor ROR-gamma
LigandBDBM285736
Substrate/Competitorn/a
Meas. Tech.RORgammat (full-length human) Reporter Assay A
IC50 1.60±n/a nM
Citation Goldberg, SSteeneck, CGege, CKinzel, OKleymann, GHoffmann, TFourie, AMXue, X Thiazoles as modulators of RORγt US Patent US10080744 Publication Date 9/25/2018
 
Nuclear receptor ROR-gamma
Name:Nuclear receptor ROR-gamma
Type:Enzyme Catalytic Domain
Mol. Mass.:58218.40
Organism:Homo sapiens (Human)
Description:P51449
Residue:518
BDBM285736
NameBDBM285736
Synonyms:US10080744, Example 3/4
TypeSmall organic molecule
Emp. Form.C25H27Cl2F3N4O5S2
Mol. Mass.655.537
SMILESCC[C@H](NS(=O)(=O)c1ccc(-c2sc(nc2CC2CCC2)-c2nnc(CC(C)(C)C(O)=O)o2)c(Cl)c1Cl)C(F)(F)F