Reaction Details
TargetNuclear receptor ROR-gamma
LigandBDBM285771
Substrate/Competitorn/a
Meas. Tech.RORgammat (full-length human) Reporter Assay A
IC50 3.20±n/a nM
Citation Goldberg, SSteeneck, CGege, CKinzel, OKleymann, GHoffmann, TFourie, AMXue, X Thiazoles as modulators of RORγt US Patent US10080744 Publication Date 9/25/2018
 
Nuclear receptor ROR-gamma
Name:Nuclear receptor ROR-gamma
Type:Enzyme Catalytic Domain
Mol. Mass.:58218.40
Organism:Homo sapiens (Human)
Description:P51449
Residue:518
BDBM285771
NameBDBM285771
Synonyms:US10080744, Example 3/38
TypeSmall organic molecule
Emp. Form.C27H30F6N4O5S2
Mol. Mass.668.671
SMILESCC[C@H](NS(=O)(=O)c1ccc(-c2sc(nc2CC2CCCC2)-c2nnc(CC(C)(C)C(O)=O)o2)c(C(F)F)c1F)C(F)(F)F