Reaction Details
TargetNuclear receptor ROR-gamma
LigandBDBM285796
Substrate/Competitorn/a
Meas. Tech.RORgammat (full-length human) Reporter Assay A
IC50 7.00±n/a nM
Citation Goldberg, SSteeneck, CGege, CKinzel, OKleymann, GHoffmann, TFourie, AMXue, X Thiazoles as modulators of RORγt US Patent US10080744 Publication Date 9/25/2018
 
Nuclear receptor ROR-gamma
Name:Nuclear receptor ROR-gamma
Type:Enzyme Catalytic Domain
Mol. Mass.:58218.40
Organism:Homo sapiens (Human)
Description:P51449
Residue:518
BDBM285796
NameBDBM285796
Synonyms:US10080744, Example 11/7
TypeSmall organic molecule
Emp. Form.C26H27F7N4O5S2
Mol. Mass.672.635
SMILESCC[C@H](NS(=O)(=O)c1ccc(-c2sc(nc2CC2CCC2)-c2noc(CC(C)(C)OC=O)n2)c(c1F)C(F)(F)F)C(F)(F)F