Reaction Details
TargetSerine/threonine-protein kinase WNK2
LigandBDBM139539
Substrate/Competitorn/a
Meas. Tech.Kinase Inhibition Assay
IC50 2785±n/a nM
Citation Reddy, EPReddy, MV Substituted pyrido[2,3-d]pyrimidin-7(8H)-ones and therapeutic uses thereof US Patent US8889696 Publication Date 11/18/2014
 
Serine/threonine-protein kinase WNK2
Name:Serine/threonine-protein kinase WNK2
Type:Protein
Mol. Mass.:242660.61
Organism:Homo sapiens (Human)
Description:Q9Y3S1
Residue:2297
BDBM139539
NameBDBM139539
Synonyms:US8889696, 39
TypeSmall organic molecule
Emp. Form.C22H16FN5OS
Mol. Mass.417.459
SMILESCn1c2nc(Nc3ccc4[nH]ccc4c3)ncc2cc(Sc2ccc(F)cc2)c1=O