Reaction Details
TargetFibroblast growth factor receptor 3
LigandBDBM139540
Substrate/Competitorn/a
Meas. Tech.Kinase Inhibition Assay
IC50 15.59±n/a nM
Citation Reddy, EPReddy, MV Substituted pyrido[2,3-d]pyrimidin-7(8H)-ones and therapeutic uses thereof US Patent US8889696 Publication Date 11/18/2014
 
Fibroblast growth factor receptor 3
Name:Fibroblast growth factor receptor 3
Type:Protein
Mol. Mass.:87699.57
Organism:Homo sapiens (Human)
Description:P22607
Residue:806
BDBM139540
NameBDBM139540
Synonyms:US10189849, staurosporine US10329300, Staurosporine US11542261, Compound staurosporine US20230312583, Compound staurosporine US8889696, Staurosporine US9586965, Control Staurosporine
TypeSmall organic molecule
Emp. Form.C27H24N4O3
Mol. Mass.452.5045
SMILESCN[C@@H]1CC2OC([C@@H]1OC)n1c3ccccc3c3c4CNC(=O)c4c4c5ccccc5n2c4c13