Reaction Details
TargetVascular endothelial growth factor receptor 2
LigandBDBM139615
Substrate/Competitorn/a
Meas. Tech.Kinase Assay
pH7.4±n/a
IC50 2200±n/a nM
Commentsextracted
Citation Hull, III, CEMalone, TC Kinase inhibitors US Patent US8889870 Publication Date 11/18/2014
 
Vascular endothelial growth factor receptor 2
Name:Vascular endothelial growth factor receptor 2
Type:Receptor Tyrosine Kinase
Mol. Mass.:151510.97
Organism:Homo sapiens (Human)
Description:P35968
Residue:1356
BDBM139615
NameBDBM139615
Synonyms:US8889870, 163 US9820989, 163
TypeSmall organic molecule
Emp. Form.C22H22N4O
Mol. Mass.358.4363
SMILESCc1cccc(NC(=O)Nc2ccc(cc2)N2CCc3ccncc3C2)c1